{"text_format":"1","workbook":"xlsx","n_sheets":16,"sheets":["Instructions","Project Info","Closing S&U","Inc & Exp","Dev Team","Pro Forma","LIHTC Info","Mgt Agt Quest","Const S&U","Dev Fee","Gap Analysis","Exh A","Risk Sharing","Change Log","Module1","Module2"],"not_rendered":{"charts":0,"images":0,"macros":0,"external_links":1,"defined_names":95,"comments":0,"pivot_tables":0},"unopened":[],"bounds":{"document_bytes":16777216,"sheet_cells":100000,"rows_first":2000,"rows_last":500,"rows_between":2000,"halvings":0,"cell_chars":16384,"cell_head_chars":4096},"cells_cut":0,"cells_raw":0,"read":"whole","date_system":"1900"}

{"sheet":"Instructions","index":0,"n_rows":43,"n_cols":6,"rows_kept":43,"cut":false,"hidden":false,"merged":[[7,2,7,5]]}
[]
[]
[null,"NHHFA Financing Application Instructions:"]
[]
[null,"This financing application has color coded tabs that must be completed, based on the financing type"]
[null,"being requested by the applicant:"]
[]
[null,null,"Type of financing:"]
[null,null,"LIHTC 4%/9%","New Construction/  Sub Rehab","Refinance - No Construction","Refinance - with Construction"]
[null,"Blue Tabs","x","x","x","x"]
[null,"Green Tabs","x"]
[null,"Red Tabs","x","x",null,"x"]
[]
[null,"All sections of the tab are required.  Staff reserves the right to reject partially completed applications."]
[]
{"$rows_left_out":29}
{"sheet":"Project Info","index":1,"n_rows":326,"n_cols":15,"rows_kept":326,"cut":false,"hidden":false,"merged":[[171,3,173,8],[3,4,3,8],[4,4,4,8],[5,4,5,6],[36,2,43,8],[244,4,244,8],[246,4,246,8],[247,4,248,8],[175,3,177,8],[179,3,181,8],[184,3,185,8],[240,4,240,5],[205,2,206,8],[195,5,195,8]]}
["PROJECT INFORMATION"]
[]
[]
[1,".","Project Name:"]
[{"$f":"A4+1","v":2},".","Project Address:"]
[{"$f":"A5+1","v":3},".","Project Community:",null,null,null,null,"                NH"]
[null,null,null,null,"                                    (city/town)",null,null,"(state)","(zip code)"]
[]
[null,null,null,null,null,null,null,"Date Application Values Entered",{"$f":"TODAY()","v":"2022-05-18"}]
[]
["Development Plan"]
[]
[{"$f":"A6+1","v":4},".","Development Type (please check all that apply):"]
[null,{"$f":"IF(LEN(TRIM(G14))>0,1,0)","v":{"$error":"#VALUE!"}},"   New construction",null,null,null,null,"Mark with an \"X\""]
[null,{"$f":"IF(LEN(TRIM(G15))>0,1,0)","v":{"$error":"#VALUE!"}},"   Acquisition and rehabilitation of existing housing",null,null,null,null,"Mark with an \"X\""]
{"$rows_left_out":312}
{"sheet":"Closing S&U","index":2,"n_rows":205,"n_cols":13,"rows_kept":205,"cut":false,"hidden":false,"merged":[[32,11,36,11],[2,0,2,9],[1,0,1,9],[0,0,0,9],[169,7,169,8],[14,8,15,8],[40,6,40,9],[16,6,16,7],[13,6,13,9],[14,6,15,7],[112,7,112,8],[113,11,113,12],[114,11,114,12],[51,3,51,4],[48,3,48,4],[45,3,45,4]]}
["CLOSING SOURCES AND USES OF FUNDS"]
[{"$f":"IF(+'Project Info'!E4=\"\",\"Un-named Project\",+'Project Info'!E4)","v":"Un-named Project"}]
["Sources of Funds"]
[]
[null,null,"Private Equity:",null,null,null,"Amount  $"]
[1,".","Developer's Cash Equity"]
[{"$f":"A6+1","v":2},null,"LIHTC Equity ",null,null,null,null,"Calculated",{"$f":"'LIHTC Info'!H42","v":0}]
[3,".","HTC Equity",null,null,null,null,"Calculated",{"$f":"'LIHTC Info'!H43","v":0}]
[4,".","Other Equity:"]
[5,".","Developer Fee Loan"]
[6,".","Other Source:"]
[7,null,"Total Private Equity",null,null,null,{"$f":"SUM(G6:G11)","v":0},"             Equity/Subsidy Per Unit:"]
[null,null,null,null,null,null,null,null,{"$f":"IFERROR((G7+F20)/'Project Info'!N69,0)","v":0}]
[null,null,"Public Equity:","Source",null,"Amount  $",{"$f":"IFERROR(IF((((G7+F20)/'Project Info'!N69)>230000),\"EQUITY & SUBSIDY EXCEEDS QAP MAXIMUM\",\"\"),\"\")","v":""}]
[{"$f":"A12+1","v":8},".","Grant:",null,null,null,"Does project fall into a high-cost category per HFA:109.04.C? Yes/No"]
{"$rows_left_out":191}
{"sheet":"Inc & Exp","index":3,"n_rows":244,"n_cols":17,"rows_kept":244,"cut":false,"hidden":false,"merged":[[107,3,107,4],[0,0,0,9],[1,0,1,9],[3,0,3,9]]}
["OPERATING PRO-FORMA"]
[{"$f":"'Closing S&U'!A2","v":"Un-named Project"}]
[null,null,null,null,null,null,null,null,null,null,null,null,"Lesser of Test - Rents"]
["Operating Income",null,null,null,null,null,null,null,null,null,null,null,"See Underwriting Standards for Policy"]
[null,null,"Rent Schedule:","Max LIHTC","Contract","Utility","% of LIHTC","Contract Rent","No. of",null,null,null,"Market Rents per market study report:"]
[1,null,{"$f":"'Project Info'!D62","v":"Market Rate"},"Gross Rent","Rent","Allowance","Max","+ Utility Allow.","Units",null,null,null,null,null,"@ 90%"]
[null,null,"SRO",null,null,null,{"$f":"IFERROR(H7/D7,\"\")","v":""},{"$f":"IF(I7>0,E7+F7,\"\")","v":""},{"$f":"'Project Info'!D63","v":0},{"$f":"(E7*I7)*12","v":0},null,null,"1 BD",null,{"$f":"N7*0.9","v":0}]
[null,null,"0 Bedroom",null,null,null,"","",{"$f":"'Project Info'!D64","v":0},0,null,null,"2 BD",null,{"$f":"N8*0.9","v":0}]
[null,null,"1 Bedroom",null,null,null,"","",{"$f":"'Project Info'!D65","v":0},0,null,null,"3 BD",null,{"$f":"N9*0.9","v":0}]
[null,null,"2 Bedroom",null,null,null,"","",{"$f":"'Project Info'!D66","v":0},0]
[null,null,"3 Bedroom",null,null,null,"","",{"$f":"'Project Info'!D67","v":0},0,null,null,"HTF Rents (see HTF Rents)",null,null,null,"Lesser of Results"]
[null,null,"4 Bedroom",null,null,null,"","",{"$f":"'Project Info'!D68","v":0},0,null,null,null,null,"@ 98%"]
[null,null,null,null,null,null,null,"Subtotal",{"$f":"SUM(I7:I12)","v":0},null,null,null,"1 BD",null,{"$f":"N13*0.98","v":0}]
[{"$f":"A6+1","v":2},null,{"$f":"'Project Info'!E62","v":"LIHTC"},{"$f":"'Project Info'!E61","v":0},null,null,null,null,null,null,null,null,"2 BD",null,{"$f":"N14*0.98","v":0}]
[null,null,"SRO",null,null,null,{"$f":"IFERROR(H15/D15,\"\")","v":""},{"$f":"IF(I15>0,E15+F15,\"\")","v":""},{"$f":"'Project Info'!E63","v":0},{"$f":"(E15*I15)*12","v":0},null,null,"3 BD",null,{"$f":"N15*0.98","v":0}]
{"$rows_left_out":230}
{"sheet":"Dev Team","index":4,"n_rows":193,"n_cols":10,"rows_kept":193,"cut":false,"hidden":false,"merged":[[71,5,71,8],[91,5,91,8],[104,5,104,8],[92,5,92,6],[92,7,92,8],[155,3,165,8],[149,5,149,8],[148,5,148,8],[147,5,147,8],[145,5,145,8],[144,2,144,3],[138,5,138,8],[139,5,139,8],[140,5,140,8],[141,5,141,8],[150,5,150,6],[150,7,150,8],[146,5,146,8],[142,5,142,6],[142,7,142,8],[72,5,72,8],[73,5,73,8],[74,5,74,8],[90,5,90,8],[47,5,47,8],[46,5,46,8],[45,5,45,8],[57,5,57,8],[58,5,58,8],[59,5,59,8],[67,5,67,8],[50,5,50,6],[64,5,64,8],[79,5,79,8],[80,5,80,8],[81,5,81,8],[82,5,82,8],[83,5,83,8],[13,5,13,8],[12,5,12,8],[11,5,11,8],[60,5,60,6],[60,7,60,8],[65,5,65,8],[68,5,68,6],[68,7,68,8],[14,5,14,8],[25,5,25,8],[36,5,36,8],[48,5,48,8],[42,5,42,8],[30,5,30,8],[31,5,31,8],[75,5,75,8],[41,5,41,8],[55,5,55,8],[49,5,49,8],[135,5,135,6],[135,7,135,8],[99,5,99,8],[122,5,122,8],[123,5,123,8],[124,5,124,8],[112,5,112,8],[114,5,114,8],[115,5,115,8],[113,5,113,8],[117,5,117,6],[117,7,117,8],[125,5,125,6],[125,7,125,8],[132,5,132,8],[133,5,133,8],[134,5,134,8],[120,5,120,8],[100,5,100,8],[105,5,105,8],[109,5,109,6],[109,7,109,8],[0,0,0,9],[87,5,87,8],[89,5,89,8],[50,7,50,8],[121,5,121,8],[7,3,7,5],[24,5,24,8],[26,7,26,8],[26,5,26,6],[35,5,35,8],[37,5,37,8],[18,5,18,8],[19,5,19,8],[20,5,20,8],[21,5,21,8],[22,5,22,8],[23,5,23,8],[97,5,97,8],[101,5,101,6],[101,7,101,8],[116,5,116,8],[106,5,106,8],[107,5,107,8],[29,5,29,8],[1,3,1,7],[32,5,32,8],[33,5,33,8],[34,5,34,8],[130,5,130,8],[131,5,131,8],[96,5,96,8],[98,5,98,8],[76,5,76,6],[76,7,76,8],[108,5,108,8],[84,5,84,6],[84,7,84,8],[38,5,38,6],[38,7,38,8],[44,5,44,8],[43,5,43,8],[88,5,88,8],[56,5,56,8],[63,5,63,8],[66,5,66,8],[10,5,10,8],[15,7,15,8],[15,5,15,6]]}
["DEVELOPMENT TEAM SUMMARY"]
[null,null,null,{"$f":"'Closing S&U'!A2","v":"Un-named Project"},null,null,null,null,null,{"$f":"IF('Project Info'!J9=\"\",\"\",'Project Info'!J9)","v":""}]
[]
[1,".","Developer/Sponsor Type (Please check one box)",null,null,null,null,"(check one)"]
[null,null,"         Any form of for-profit corporation, partnership, or individual",null,null,null,null,null,null,{"$f":"IF(H5<>\" \",1,0)","v":0}]
[null,null,"         Non-profit corporation",null,null,null,null,null,null,{"$f":"IF(H6<>\" \",1,0)","v":0}]
[null,null,"         Limited equity housing cooperative",null,null,null,null," ",null,{"$f":"IF(H7<>\" \",1,0)","v":0}]
[null,null,"         Other:     ",null,null,null,null," ",null,{"$f":"IF(H8<>\" \",1,0)","v":0}]
[]
[{"$f":"A4+1","v":2},".","Developer/Sponsor:",null," "]
[null,null,null,"Legal Name"]
[null,null,null,"Address"]
[]
[null,null,null,"Contact Person"]
[null,null,null,"Email Address"]
{"$rows_left_out":179}
{"sheet":"Pro Forma","index":5,"n_rows":210,"n_cols":10,"rows_kept":210,"cut":false,"hidden":false,"merged":[]}
[]
[null,"NH Housing Financing Application",null,null,null,null,null,null,null,"Page 1 of 4"]
[null,{"$f":"'Closing S&U'!A2","v":"Un-named Project"}]
[null,"20-Year Operating Proforma (Years 1-5)"]
[]
[]
[null,null,null,null,null,"Year 1","Year 2","Year 3","Year 4","Year 5"]
[null,null,null,null,"Calendar Year :",{"$f":"IF(+'Project Info'!G51>0,+'Project Info'!B51,\"             N/A \")","v":"             N/A "},{"$f":"IF(F8>0,F8+1,\"             N/A \")","v":"             N/A "},{"$f":"IF(G8>0,G8+1,\"             N/A \")","v":"             N/A "},{"$f":"IF(H8>0,H8+1,\"             N/A \")","v":"             N/A "},{"$f":"IF(I8>0,I8+1,\"             N/A \")","v":"             N/A "}]
[null,null,"INCOME:"]
[null,null,null,"Market Rate Units",null,{"$f":"SUM('Inc & Exp'!J7:J12)","v":0},{"$f":"F10*(1+'Inc & Exp'!E111)","v":0},{"$f":"G10*(1+'Inc & Exp'!F111)","v":0},{"$f":"H10*(1+'Inc & Exp'!G111)","v":0},{"$f":"I10*(1+'Inc & Exp'!H111)","v":0}]
[null,null,null,"Tax Credit Units",null,{"$f":"SUM('Inc & Exp'!J15:J44)","v":0},{"$f":"F11*(1+'Inc & Exp'!E112)","v":0},{"$f":"G11*(1+'Inc & Exp'!F112)","v":0},{"$f":"H11*(1+'Inc & Exp'!G112)","v":0},{"$f":"I11*(1+'Inc & Exp'!H112)","v":0}]
[null,null,null,"HOME Units",null,{"$f":"SUM('Inc & Exp'!J52:J65)","v":0},{"$f":"F12*(1+'Inc & Exp'!E113)","v":0},{"$f":"G12*(1+'Inc & Exp'!F113)","v":0},{"$f":"H12*(1+'Inc & Exp'!G113)","v":0},{"$f":"I12*(1+'Inc & Exp'!H113)","v":0}]
[null,null,null,"HTF Units",null,{"$f":"SUM('Inc & Exp'!J68:J73)","v":0},{"$f":"F13*(1+'Inc & Exp'!E114)","v":0},{"$f":"G13*(1+'Inc & Exp'!F114)","v":0},{"$f":"H13*(1+'Inc & Exp'!G114)","v":0},{"$f":"I13*(1+'Inc & Exp'!H114)","v":0}]
[null,null,null,"811 Units",null,{"$f":"SUM('Inc & Exp'!J76:J81)","v":0},{"$f":"F14*(1+'Inc & Exp'!E115)","v":0},{"$f":"G14*(1+'Inc & Exp'!F115)","v":0},{"$f":"H14*(1+'Inc & Exp'!G115)","v":0},{"$f":"I14*(1+'Inc & Exp'!H115)","v":0}]
[null,null,null,"Rental Assisted Units",null,{"$f":"SUM('Inc & Exp'!J84:J89)","v":0},{"$f":"F15*(1+'Inc & Exp'!E116)","v":0},{"$f":"G15*(1+'Inc & Exp'!F116)","v":0},{"$f":"H15*(1+'Inc & Exp'!G116)","v":0},{"$f":"I15*(1+'Inc & Exp'!H116)","v":0}]
{"$rows_left_out":196}
{"sheet":"LIHTC Info","index":6,"n_rows":164,"n_cols":9,"rows_kept":164,"cut":false,"hidden":false,"merged":[[18,2,18,8]]}
["LOW INCOME HOUSING TAX CREDITS"]
[{"$f":"'Closing S&U'!A2","v":"Un-named Project"}]
[null,null," "]
[null,null,"Percent of Project Which Qualifies for Tax Credit:"]
[]
[1,".","Low-Income Units*",null,{"$f":"'Project Info'!N69-'Project Info'!D69","v":0},null,"Total Units ",{"$f":"'Project Info'!N69","v":0}]
[{"$f":"A6+1","v":2},".","Percent of Units ",null,{"$f":"IF(H6>0,E6/H6,0)","v":0}]
[]
[{"$f":"A7+1","v":3},".","Low-Income Square Feet*",null,null,"(net rentable)","Total Area",{"$f":"'Project Info'!F126","v":0},"(net rentable)"]
[{"$f":"A9+1","v":4},".","Percent of Area ",null,{"$f":"IF(H9>0,E9/H9,0)","v":0}]
[null,null,null,"*  Applies to only housing units that qualify for tax credits"]
[{"$f":"A10+1","v":5},".","Applicable fraction",null,{"$f":"IF(E10>E7,E7,E10)","v":0},"   (This is the lower of 2 or 4 above.)"]
[{"$f":"A12+1","v":6},".","Is the project utilizing tax-exempt financing?",null,null,null,null,null," (\"yes\" or \"no\")"]
[7,".","Enter applicable percentage for acquisition credit if project qualifies**",null,null,null,null,0," (.04 or actual)"]
[8,".","Enter applicable percentage for rehabilitation credit or new construction**",null,null,null,null,0.09," (.04,.09 or actual)"]
{"$rows_left_out":150}
{"sheet":"Mgt Agt Quest","index":7,"n_rows":67,"n_cols":6,"rows_kept":67,"cut":false,"hidden":false,"merged":[[12,1,12,2],[5,0,5,5],[7,0,7,4],[8,0,8,2],[9,1,9,2],[11,3,11,5],[6,1,6,2],[32,3,32,5],[14,3,14,5],[15,1,15,2],[16,3,16,5],[17,1,17,2],[19,1,19,2],[19,3,19,5],[22,1,22,2],[29,1,29,2],[30,3,30,5],[31,1,31,2],[33,2,33,4],[35,0,35,2],[36,1,36,2],[36,5,37,5],[38,1,38,2],[38,5,39,5],[42,0,43,0],[42,1,43,2],[42,3,43,3],[42,4,43,4],[42,5,43,5],[40,0,41,0],[40,1,41,2],[40,3,41,3],[40,4,41,4],[40,5,41,5],[44,1,44,2],[45,1,45,2],[46,0,47,0],[46,1,47,2],[46,3,47,3],[51,5,52,5],[46,5,47,5],[48,0,49,0],[48,1,49,2],[48,3,49,3],[48,4,49,4],[48,5,49,5],[46,4,47,4],[50,1,50,2],[51,0,52,0],[51,1,52,2],[51,3,52,3],[51,4,52,4],[53,5,54,5],[55,0,56,0],[55,1,56,2],[55,3,56,3],[55,4,56,4],[55,5,56,5],[59,1,59,2],[53,0,54,0],[53,1,54,2],[53,3,54,3],[53,4,54,4]]}
[null,null,"MANAGEMENT AGENT QUESTIONNAIRE"]
[]
["Please use an \"x\" to fill in check boxes - form will automatically tally score."]
["Note: This form used for LIHTC Application Scoring and for Threshold Determination"]
["Additional explanation/notes can be added below"]
["Management Company Profiled: "]
[]
[null,null,null,null,null," Scoring"]
["Questions 1 – 7 are used in LIHTC scoring.",null,null,"Yes","No"]
[1,"Does the Agent have experience managing and/or own properties receiving subsidies or rental assistance other than Low Income Housing Tax Credit (LIHTC)?",null,null,"⁭",{"$f":"IF(D10=\"x\",1,0)","v":0}]
[null,"    ","If yes, more than five years of experience?",null,"⁭",{"$f":"IF(D11=\"x\",1,0)","v":0}]
[null,"     ","If yes, identify the Contract Administrator and/or Compliance Agency and the number of properties, number of units, location and years of experience."]
[2,"Does the Agent have experience managing LIHTC properties?",null,"⁭","⁭",{"$f":"IF(D13=\"x\",1,0)","v":0}]
[null,"    ","If yes, more than five years experience?",null,"⁭",{"$f":"IF(D14=\"x\",1,0)","v":0}]
[null,null,"If yes, identify the compliance agency and the number of properties, number of units, location and years of experience."]
{"$rows_left_out":53}
{"sheet":"Const S&U","index":8,"n_rows":100,"n_cols":40,"rows_kept":100,"cut":false,"hidden":false,"merged":[]}
["Disbursement Schedule",null,null,"Project:",{"$f":"+'Project Info'!E4","v":0}]
[null,null,"Budget","Expended Prior to Closing","Paid at Closing","Total expended  thru closing ","Month 1 Draw","Month 2 Draw","Month 3 Draw","Month 4 Draw","Month 5 Draw","Month 6 Draw","Month 7 Draw","Month 8 Draw","Month 9 Draw","Month 10 Draw","Month 11 Draw","Month 12 Draw","Month 13 Draw","Month 14 Draw","Month 15 Draw","Month 16 Draw","Month 17 Draw","Month 18 Draw","Month 19 Draw","Month 20 Draw","Month 21 Draw","Month 22 Draw","Month 23 Draw","Month 24 Draw","Month 25 Draw","Month 26 Draw","Month 27 Draw","Month 28 Draw","Month 29 Draw","Month 30 Draw",null,"Total to Date",null,"Balance to  Complete"]
["Sources of Funds:"]
[{"$f":"'Closing S&U'!C6","v":"Developer's Cash Equity"},null,{"$f":"'Closing S&U'!G6","v":0},null,null,{"$f":"D4+E4","v":0},null,null,null,null,null,null,null,null,null,null,null,null,null,null,null,null,null,null,null,null,null,null,null,null,null,null,null,null,null,null,null,{"$f":"SUM(F4:AJ4)","v":0},null,{"$f":"C4-AL4","v":0}]
["LIHTC Equity",null,{"$f":"'LIHTC Info'!H44","v":0},null,null,0,null,null,null,null,null,null,null,null,null,null,null,null,null,null,null,null,null,null,null,null,null,null,null,null,null,null,null,null,null,null,null,{"$f":"SUM(F5:AJ5)","v":0},null,0]
[{"$f":"'Closing S&U'!C8","v":"HTC Equity"},null,{"$f":"'Closing S&U'!G8","v":0},null,null,0]
[{"$f":"'Closing S&U'!C9","v":"Other Equity:"},{"$f":"'Closing S&U'!D9","v":0},{"$f":"'Closing S&U'!G9","v":0},null,null,0,null,null,null,null,null,null,null,null,null,null,null,null,null,null,null,null,null,null,null,null,null,null,null,null,null,null,null,null,null,null,null,0,null,0]
[{"$f":"'Closing S&U'!C10","v":"Developer Fee Loan"},null,{"$f":"'Closing S&U'!G10","v":0},null,null,0,null,null,null,null,null,null,null,null,null,null,null,null,null,null,null,null,null,null,null,null,null,null,null,null,null,null,null,null,null,null,null,0,null,0]
[{"$f":"'Closing S&U'!C11","v":"Other Source:"},{"$f":"'Closing S&U'!D11","v":0},{"$f":"'Closing S&U'!G11","v":0},null,null,0,null,null,null,null,null,null,null,null,null,null,null,null,null,null,null,null,null,null,null,null,null,null,null,null,null,null,null,null,null,null,null,0,null,0]
[{"$f":"'Closing S&U'!C15","v":"Grant:"},{"$f":"'Closing S&U'!D15","v":0},{"$f":"'Closing S&U'!F15","v":0},null,null,{"$f":"D10+E10","v":0},null,null,null,null,null,null,null,null,null,null,null,null,null,null,null,null,null,null,null,null,null,null,null,null,null,null,null,null,null,null,null,0,null,0]
[{"$f":"'Closing S&U'!C16","v":"Grant:"},{"$f":"'Closing S&U'!D16","v":0},{"$f":"'Closing S&U'!F16","v":0},null,null,0,null,null,null,null,null,null,null,null,null,null,null,null,null,null,null,null,null,null,null,null,null,null,null,null,null,null,null,null,null,null,null,0,null,0]
[{"$f":"'Closing S&U'!C20","v":"NH Housing Capital Subsidy Funds"},null,{"$f":"'Closing S&U'!F20","v":0},null,null,0,null,null,null,null,null,null,null,null,null,null,null,null,null,null,null,null,null,null,null,null,null,null,null,null,null,null,null,null,null,null,null,0,null,0]
[{"$f":"'Closing S&U'!C22","v":"Subordinate Debt"},{"$f":"'Closing S&U'!D23","v":0},{"$f":"'Closing S&U'!F22","v":0},null,null,0,null,null,null,null,null,null,null,null,null,null,null,null,null,null,null,null,null,null,null,null,null,null,null,null,null,null,null,null,null,null,null,0,null,0]
[{"$f":"'Closing S&U'!C24","v":"Subordinate Debt"},{"$f":"'Closing S&U'!D25","v":0},{"$f":"'Closing S&U'!F24","v":0},null,null,0,null,null,null,null,null,null,null,null,null,null,null,null,null,null,null,null,null,null,null,null,null,null,null,null,null,null,null,null,null,null,null,0,null,0]
[{"$f":"'Closing S&U'!C26","v":"Subordinate Debt"},{"$f":"'Closing S&U'!D27","v":0},{"$f":"'Closing S&U'!F26","v":0},null,null,{"$f":"D15+E15","v":0},null,null,null,null,null,null,null,null,null,null,null,null,null,null,null,null,null,null,null,null,null,null,null,null,null,null,null,null,null,null,null,0,null,0]
{"$rows_left_out":86}
{"sheet":"Dev Fee","index":9,"n_rows":45,"n_cols":23,"rows_kept":45,"cut":false,"hidden":false,"merged":[[0,0,0,3],[41,0,41,1]]}
["Developer Fee Schedule"]
[]
["Project Name",{"$f":"'Project Info'!E4","v":0}]
[]
[null,"Developer Fees"]
[]
["The developer fee is not a guaranteed or automatic budgetary figure, and must be approved by the Authority"]
["within the context of each project.  The fee will be strictly limited, with any violations of the developer"]
["certification of development cost forwarded to the IRS using IRS form 8823.  For purposes of calculating the"]
["maximum developer fee allowed, the Authority does not distinguish between the developer fee and fees for"]
["consultants doing those tasks typically done by a developer, regardless of whether the applicant is a for-"]
["profit or non-profit entity.  \"Consultant fees\" counted as developer fee do not include professional fees such"]
["as architectural, engineering, or appraisal fees."]
[]
["Maximum Developer Fee Calculation"]
{"$rows_left_out":31}
{"sheet":"Gap Analysis","index":10,"n_rows":39,"n_cols":4,"rows_kept":39,"cut":false,"hidden":true,"merged":[]}
[{"$f":"'Project Info'!E4","v":0}]
[null,"LIHTC GAP ANALYSIS"]
[]
[]
["Note: For use by NH Housing Only"]
[]
["EQUITY GAP DETERMINATION"]
[]
["Total Sources of Mortgage Debt ",null,null,{"$f":"'Closing S&U'!F20+'Closing S&U'!F22+'Closing S&U'!F24+'Closing S&U'!F26+'Closing S&U'!F28+'Closing S&U'!F33+'Closing S&U'!F35+'Closing S&U'!F37","v":0}]
["Developer fee loan",null,null,{"$f":"'Closing S&U'!G10","v":0}]
["Grants",null,null,{"$f":"'Closing S&U'!F15+'Closing S&U'!F16","v":0}]
["Other ",null,null,{"$f":"'Closing S&U'!G11","v":0}]
["     Total Non-Credit Sources of Funds",null,null,{"$f":"SUM(D9:D12)","v":0}]
[]
["Total Equity Needed",null,null,{"$f":"'LIHTC Info'!E159","v":0}]
{"$rows_left_out":25}
{"sheet":"Exh A","index":11,"n_rows":135,"n_cols":8,"rows_kept":135,"cut":false,"hidden":true,"merged":[]}
[null,null,"9% credit",null,0.09,null,"Total 9% Basis",{"$f":"'LIHTC Info'!H159","v":0}]
["Credit Rate Assumptions:",null,"4% credit",null,{"$f":"'LIHTC Info'!H14","v":0},null,"Total 4% Basis",{"$f":"'LIHTC Info'!G159","v":0}]
[null,null,"Month of Lock In (for 4% Acq. Credits)",null,{"$f":"1/2020","v":"00:00:42.772"},null,"Total # of Buildings",{"$f":"'Project Info'!I114","v":0}]
[]
["Carryover Allocation Agreement - Exhibit A",null,null,null,null,"Table Page 1 of  1"]
[]
["Project Name:",{"$f":"'Project Info'!E4:I4","v":{"$error":"#VALUE!"}}]
[]
["Building BIN #","NH-11-00000","NH-11-00000","NH-11-00000","NH-11-00000","NH-11-00000","NH-11-00000","Total"]
["Building Address or"]
["Site Description"]
[]
["Building Type: New Construction"]
[" Rehab or Acquisition","New Construct",{"$f":"B14","v":"New Construct"},{"$f":"B14","v":"New Construct"},{"$f":"B14","v":"New Construct"},{"$f":"B14","v":"New Construct"},{"$f":"B14","v":"New Construct"}]
[]
{"$rows_left_out":121}
{"sheet":"Risk Sharing","index":12,"n_rows":341,"n_cols":3,"rows_kept":341,"cut":false,"hidden":true,"merged":[]}
["NHHFA","Sources and Uses of Funds"]
["Section 911 Subsidy Layering Review"]
[]
["Project Name:",{"$f":"'Project Info'!E4","v":0}]
["NHHFA Project No.:"]
[]
["SOURCES"]
["Debt Sources:"]
["HUD Loans/programs (HOME)"]
["Other Government Assistance"]
["Other Loans"]
["   NHHFA Tax Exempt Bond",0]
["   Deferred Developer Fee",0]
["   Other"]
["Debt Subtotal",0]
{"$rows_left_out":327}
{"sheet":"Change Log","index":13,"n_rows":32,"n_cols":3,"rows_kept":32,"cut":false,"hidden":true,"merged":[]}
["Change Date","Item","Notes"]
["2019-02-21","Fixed Control C macro error","No more errors,  Ctrl+c now works."]
["2019-02-21","Renamed tabs to ease navigation & colored based on project type","Not married to these names, however, we should be more descriptive on what the tabs are"]
["2019-02-21","Added instruction tab","This will help alleviate some questions on what to fill out for different project types"]
["2018-04-09","Updated tabs for income averaging"]
["2018-04-09","Changed active X controls","Application can be edited online now"]
["2019-04-09","Deleted print summary tab"]
["2019-04-09","Increased the developer fee 12%","Cleaned up writing on tab, naming of project type. Will delete on publishing."]
["2019-04-09","Change font on application tabs"]
["2019-04-15","Changes to the Gap Analysis tab & Exh A "]
["2019-04-15","Add additional cagetories to professional fees.  Renamed category."]
["2019-04-15","Added upfront MIP, trustee fee, and application fee to Financing Fees and Expenses"]
["2019-04-23","Split financial page into three tabs"]
["2019-04-23","Updated income bands on rent tab to auto poplulate"]
["2019-04-23","Cleaned up broken links, formulas.  "]
{"$rows_left_out":18}
{"sheet":"Module1","index":14,"n_rows":0,"n_cols":0,"rows_kept":0,"cut":false,"hidden":true,"merged":[]}

{"sheet":"Module2","index":15,"n_rows":0,"n_cols":0,"rows_kept":0,"cut":false,"hidden":true,"merged":[]}