{"text_format":"1","workbook":"xlsx","n_sheets":16,"sheets":["Instructions","Project Info","Closing S&U","Inc & Exp","LIHTC Info","Dev Team","Const S&U","Pro Forma","Dev Fee","Sheet1","Gap Analysis","Exh A","Risk Sharing","Change Log","Module1","Module2"],"not_rendered":{"charts":0,"images":0,"macros":0,"external_links":1,"defined_names":92,"comments":0,"pivot_tables":0},"unopened":[],"bounds":{"document_bytes":16777216,"sheet_cells":100000,"rows_first":2000,"rows_last":500,"rows_between":2000,"halvings":0,"cell_chars":16384,"cell_head_chars":4096},"cells_cut":0,"cells_raw":0,"read":"whole","date_system":"1900"}

{"sheet":"Instructions","index":0,"n_rows":37,"n_cols":6,"rows_kept":37,"cut":false,"hidden":false,"merged":[[5,2,5,5],[0,0,0,7],[1,0,1,7]]}
["New Hampshire Housing Financing Application 2025-2026 Qualified Allocation Plan"]
["Version 1, June 10, 2024"]
[]
[null,"This financing application has color coded tabs that must be completed based on the financing sought by the applicant"]
[]
[null,null,"Type of financing:"]
[null,null,"LIHTC 4%/9%","New Construction/  Sub Rehab","Refinance - No Construction","Refinance - with Construction"]
[null,"Blue Tabs","x","x","x","x"]
[null,"Green Tabs","x"]
[null,"Red Tabs","x","x",null,"x"]
[]
[null,"All sections of the tab are required.  Staff reserves the right to reject partially completed applications."]
[]
[null,"Please ensure that when submitting the completed application, that Section 2 of the Development Team tab is"]
[null,"signed and mailed to the Authority along with the applicable application fee."]
{"$rows_left_out":23}
{"sheet":"Project Info","index":1,"n_rows":289,"n_cols":15,"rows_kept":289,"cut":false,"hidden":false,"merged":[[192,3,194,8],[2,4,2,8],[3,4,3,8],[4,4,4,6],[47,2,54,8],[263,4,263,8],[265,4,265,8],[266,4,267,8],[196,3,198,8],[200,3,202,8],[205,3,206,8],[259,4,259,5],[226,2,227,8],[216,5,216,8]]}
["PROJECT INFORMATION"]
[]
[1,".","Project Name:"]
[{"$f":"A3+1","v":2},".","Project Address:"]
[{"$f":"A4+1","v":3},".","Project Community:",null,null,null,null,"                NH"]
[null,null,null,null,"                                    (city/town)",null,null,"(state)","(zip code)"]
[]
["Application Submission - Project Status"]
[4,null,"Please select the status of your project: "]
[null,null,"   Preapplication",null,null,null,null,"Mark with an \"X\""]
[null,null,"   Final Application",null,null,null,null,"Mark with an \"X\""]
[null,null,"   NH Housing Financing Commitment",null,null,null,null,"Mark with an \"X\""]
[null,null,"   Financial Closing ",null,null,null,null,"Mark with an \"X\""]
[null,null,"   9% LIHTC Carryover Allocation ",null,null,null,null,"Mark with an \"X\""]
[null,null,"   Final Allocation (8609)",null,null,null,null,"Mark with an \"X\""]
{"$rows_left_out":275}
{"sheet":"Closing S&U","index":2,"n_rows":248,"n_cols":13,"rows_kept":248,"cut":false,"hidden":false,"merged":[[167,7,167,8],[166,7,166,8],[151,7,151,8],[155,7,155,8],[156,7,156,8],[0,0,0,9],[188,7,188,8],[41,6,41,9],[16,6,16,7],[13,6,13,9],[14,6,15,7],[113,7,113,8],[52,3,52,4],[49,3,49,4],[46,3,46,4],[30,3,30,4],[20,3,20,4],[22,3,22,4],[24,3,24,4],[26,3,26,4],[114,7,114,8],[157,7,157,8],[158,7,158,8],[172,7,172,8],[173,7,173,8],[140,7,140,8],[154,7,154,8],[165,7,165,8],[137,7,137,8],[145,7,145,8],[159,7,159,8],[160,7,160,8],[161,7,161,8],[162,7,162,8],[34,11,37,11],[2,0,2,9],[1,0,1,9],[114,11,114,12],[115,11,115,12],[28,3,28,4],[59,4,59,8],[60,4,60,8],[127,7,127,8],[121,7,121,8],[205,7,205,8],[215,7,215,8],[115,7,115,8],[116,7,116,8],[117,7,117,8],[118,7,118,8],[122,7,122,8],[129,7,129,8],[130,7,130,8],[131,7,131,8],[132,7,132,8],[133,7,133,8],[134,7,134,8],[135,7,135,8],[136,7,136,8],[146,7,146,8],[147,7,147,8],[148,7,148,8],[149,7,149,8],[150,7,150,8],[141,7,141,8],[142,7,142,8],[143,7,143,8],[144,7,144,8],[168,7,168,8],[169,7,169,8],[170,7,170,8],[171,7,171,8],[201,7,201,8],[182,7,182,8],[183,7,183,8],[184,7,184,8],[195,7,195,8],[196,7,196,8],[177,7,177,8],[178,7,178,8],[179,7,179,8],[180,7,180,8],[181,7,181,8],[194,7,194,8],[189,7,189,8],[174,7,174,8],[175,7,175,8],[176,7,176,8],[8,3,8,5],[10,3,10,5],[14,3,14,4],[15,3,15,4],[36,3,36,4],[38,3,38,4],[45,3,45,4],[48,3,48,4],[51,3,51,4],[244,2,244,3],[234,2,234,3],[242,2,242,4],[127,2,127,3],[243,2,243,3],[233,2,233,3],[232,2,232,6],[220,7,220,8],[221,7,221,8],[222,7,222,8],[213,7,213,8],[216,7,216,8],[217,7,217,8],[218,7,218,8],[219,7,219,8],[202,7,202,8],[209,7,209,8],[210,7,210,8],[211,7,211,8],[212,7,212,8],[197,7,197,8],[198,7,198,8],[199,7,199,8],[200,7,200,8]]}
["CLOSING SOURCES AND USES OF FUNDS"]
[{"$f":"IF(+'Project Info'!E3=\"\",\"Un-named Project\",+'Project Info'!E3)","v":"Un-named Project"}]
["Sources of Funds"]
[]
[null,null,"Private Equity:",null,null,null,"Amount  $"]
[1,".","Developer's Cash Equity"]
[{"$f":"A6+1","v":2},null,"LIHTC Equity ",null,null,null,null,"Calculated",{"$f":"'LIHTC Info'!H42","v":{"$error":"#VALUE!"}}]
[3,".","HTC Equity",null,null,null,null,"Calculated",{"$f":"'LIHTC Info'!H43","v":0}]
[4,".","Other Equity:"]
[5,".","Developer Fee Loan"]
[6,".","Other Source:"]
[7,null,"Total Private Equity",null,null,null,{"$f":"SUM(G6:G11)","v":0}]
[]
[null,null,"Public Equity:","Source",null,"Amount  $",{"$f":"IFERROR(IF((((G7+F20)/'Project Info'!N82)>230000),\"EQUITY & SUBSIDY EXCEEDS QAP MAXIMUM\",\"\"),\"\")","v":""}]
[{"$f":"A12+1","v":8},".","Grant:"]
{"$rows_left_out":234}
{"sheet":"Inc & Exp","index":3,"n_rows":261,"n_cols":10,"rows_kept":261,"cut":false,"hidden":false,"merged":[[118,3,118,4],[0,0,0,9],[1,0,1,9],[3,0,3,9]]}
["OPERATING PRO-FORMA"]
[{"$f":"'Closing S&U'!A2","v":"Un-named Project"}]
[]
["Operating Income"]
[null,null,"Rent Schedule:"]
[1,null,{"$f":"'Project Info'!D75","v":"Market Rate"},"Market Rent ","Contract Rent","Utility Allowance","% of Market Rent","Gross Rent","# of Units "]
[null,null,"SRO",null,null,null,{"$f":"IFERROR(H7/D7,\"\")","v":""},{"$f":"IF(I7>0,E7+F7,\"\")","v":""},{"$f":"'Project Info'!D76","v":0},{"$f":"(E7*I7)*12","v":0}]
[null,null,"0 Bedroom",null,null,null,"","",{"$f":"'Project Info'!D77","v":0},0]
[null,null,"1 Bedroom",null,null,null,"","",{"$f":"'Project Info'!D78","v":0},0]
[null,null,"2 Bedroom",null,null,null,"","",{"$f":"'Project Info'!D79","v":0},0]
[null,null,"3 Bedroom",null,null,null,"","",{"$f":"'Project Info'!D80","v":0},0]
[null,null,"4 Bedroom",null,null,null,"","",{"$f":"'Project Info'!D81","v":0},0]
[null,null,null,null,null,null,null,"Subtotal",{"$f":"SUM(I7:I12)","v":0}]
[]
[{"$f":"A6+1","v":2},null,{"$f":"'Project Info'!E75","v":"LIHTC 20% AMI/HTF PBV"},"Rent Limit ","Contract Rent","Utility Allowance","% of Rent Limit","Gross Rent","# of Units"]
{"$rows_left_out":247}
{"sheet":"LIHTC Info","index":4,"n_rows":202,"n_cols":9,"rows_kept":202,"cut":false,"hidden":false,"merged":[[18,2,18,8]]}
["LOW INCOME HOUSING TAX CREDITS"]
[{"$f":"'Closing S&U'!A2","v":"Un-named Project"}]
[null,null," "]
[null,null,"Percent of Project Which Qualifies for Tax Credit:"]
[]
[1,".","Low-Income Units*",null,{"$f":"'Project Info'!N82-'Project Info'!D82","v":0},null,"Total Units ",{"$f":"'Project Info'!N82","v":0}]
[{"$f":"A6+1","v":2},".","Percent of Units ",null,{"$f":"IF(H6>0,E6/H6,0)","v":0}]
[]
[{"$f":"A7+1","v":3},".","Low-Income Square Feet*",null,null,"(net rentable)","Total Area",{"$f":"'Project Info'!F135","v":0},"(net rentable)"]
[{"$f":"A9+1","v":4},".","Percent of Area ",null,{"$f":"IF(H9>0,E9/H9,0)","v":0}]
[null,null,null,"*  Applies to only housing units that qualify for tax credits"]
[{"$f":"A10+1","v":5},".","Applicable fraction",null,{"$f":"IF(E10>E7,E7,E10)","v":0},"   (This is the lower of 2 or 4 above.)"]
[{"$f":"A12+1","v":6},".","Is the project utilizing tax-exempt financing?",null,null,null,null,"No"," (\"yes\" or \"no\")"]
[7,".","Enter applicable percentage for acquisition credit if project qualifies**",null,null,null,null,0.04," (.04 or actual)"]
[8,".","Enter applicable percentage for rehabilitation credit or new construction**",null,null,null,null,null," (.04,.09 or actual)"]
{"$rows_left_out":188}
{"sheet":"Dev Team","index":5,"n_rows":193,"n_cols":10,"rows_kept":193,"cut":false,"hidden":false,"merged":[[71,5,71,8],[91,5,91,8],[104,5,104,8],[92,5,92,6],[92,7,92,8],[155,3,165,8],[149,5,149,8],[148,5,148,8],[147,5,147,8],[145,5,145,8],[144,2,144,3],[138,5,138,8],[139,5,139,8],[140,5,140,8],[141,5,141,8],[150,5,150,6],[150,7,150,8],[146,5,146,8],[142,5,142,6],[142,7,142,8],[72,5,72,8],[73,5,73,8],[74,5,74,8],[90,5,90,8],[47,5,47,8],[46,5,46,8],[45,5,45,8],[57,5,57,8],[58,5,58,8],[59,5,59,8],[67,5,67,8],[50,5,50,6],[64,5,64,8],[79,5,79,8],[80,5,80,8],[81,5,81,8],[82,5,82,8],[83,5,83,8],[13,5,13,8],[12,5,12,8],[11,5,11,8],[60,5,60,6],[60,7,60,8],[65,5,65,8],[68,5,68,6],[68,7,68,8],[14,5,14,8],[25,5,25,8],[36,5,36,8],[48,5,48,8],[42,5,42,8],[30,5,30,8],[31,5,31,8],[75,5,75,8],[41,5,41,8],[55,5,55,8],[49,5,49,8],[135,5,135,6],[135,7,135,8],[99,5,99,8],[122,5,122,8],[123,5,123,8],[124,5,124,8],[112,5,112,8],[114,5,114,8],[115,5,115,8],[113,5,113,8],[117,5,117,6],[117,7,117,8],[125,5,125,6],[125,7,125,8],[132,5,132,8],[133,5,133,8],[134,5,134,8],[120,5,120,8],[100,5,100,8],[105,5,105,8],[109,5,109,6],[109,7,109,8],[0,0,0,9],[87,5,87,8],[89,5,89,8],[50,7,50,8],[121,5,121,8],[7,3,7,5],[24,5,24,8],[26,7,26,8],[26,5,26,6],[35,5,35,8],[37,5,37,8],[18,5,18,8],[19,5,19,8],[20,5,20,8],[21,5,21,8],[22,5,22,8],[23,5,23,8],[97,5,97,8],[101,5,101,6],[101,7,101,8],[116,5,116,8],[106,5,106,8],[107,5,107,8],[29,5,29,8],[1,3,1,7],[32,5,32,8],[33,5,33,8],[34,5,34,8],[130,5,130,8],[131,5,131,8],[96,5,96,8],[98,5,98,8],[76,5,76,6],[76,7,76,8],[108,5,108,8],[84,5,84,6],[84,7,84,8],[38,5,38,6],[38,7,38,8],[44,5,44,8],[43,5,43,8],[88,5,88,8],[56,5,56,8],[63,5,63,8],[66,5,66,8],[10,5,10,8],[15,7,15,8],[15,5,15,6]]}
["DEVELOPMENT TEAM SUMMARY"]
[null,null,null,{"$f":"'Closing S&U'!A2","v":"Un-named Project"}]
[]
[1,".","Developer/Sponsor Type (Please check one box)",null,null,null,null,"(check one)"]
[null,null,"         Any form of for-profit corporation, partnership, or individual",null,null,null,null,null,null,{"$f":"IF(H5<>\" \",1,0)","v":0}]
[null,null,"         Non-profit corporation",null,null,null,null,null,null,{"$f":"IF(H6<>\" \",1,0)","v":0}]
[null,null,"         Limited equity housing cooperative",null,null,null,null," ",null,{"$f":"IF(H7<>\" \",1,0)","v":0}]
[null,null,"         Other:     ",null,null,null,null," ",null,{"$f":"IF(H8<>\" \",1,0)","v":0}]
[]
[{"$f":"A4+1","v":2},".","Developer/Sponsor:",null," "]
[null,null,null,"Legal Name"]
[null,null,null,"Address"]
[]
[null,null,null,"Contact Person"]
[null,null,null,"Email Address"]
{"$rows_left_out":179}
{"sheet":"Const S&U","index":6,"n_rows":123,"n_cols":54,"rows_kept":123,"cut":false,"hidden":false,"merged":[]}
["Disbursement Schedule"]
[null,null,"Budget","Expended Prior to Closing","Paid at Closing","Total expended  thru closing ","Month 1 Draw","Month 2 Draw","Month 3 Draw","Month 4 Draw","Month 5 Draw","Month 6 Draw","Month 7 Draw","Month 8 Draw","Month 9 Draw","Month 10 Draw","Month 11 Draw","Month 12 Draw","Month 13 Draw","Month 14 Draw","Month 15 Draw","Month 16 Draw","Month 17 Draw","Month 18 Draw","Month 19 Draw","Month 20 Draw","Month 21 Draw","Month 22 Draw","Month 23 Draw","Month 24 Draw","Month 25 Draw","Month 26 Draw","Month 27 Draw","Month 28 Draw","Month 29 Draw","Month 30 Draw","Month 31 Draw","Month 30 Draw","Month 31 Draw","Month 32 Draw","Month 33 Draw","Month 34 Draw","Month 35 Draw","Month 36 Draw","Month 25 Draw","Month 26 Draw","Month 27 Draw","Month 28 Draw","Month 29 Draw","Month 30 Draw",null,"Total to Date",null,"Balance to  Complete"]
[]
["Sources of Funds:"]
[{"$f":"'Closing S&U'!C6","v":"Developer's Cash Equity"},null,{"$f":"'Closing S&U'!G6","v":0},null,null,{"$f":"D5+E5","v":0},null,null,null,null,null,null,null,null,null,null,null,null,null,null,null,null,null,null,null,null,null,null,null,null,null,null,null,null,null,null,null,null,null,null,null,null,null,null,null,null,null,null,null,null,null,{"$f":"SUM(F5:AX5)","v":0},null,{"$f":"C5-AZ5","v":0}]
[{"$f":"'Closing S&U'!C7","v":"LIHTC Equity "},null,{"$f":"'Closing S&U'!G7","v":0},null,null,0,null,null,null,null,null,null,null,null,null,null,null,null,null,null,null,null,null,null,null,null,null,null,null,null,null,null,null,null,null,null,null,null,null,null,null,null,null,null,null,null,null,null,null,null,null,{"$f":"SUM(F6:AX6)","v":0},null,0]
[{"$f":"'Closing S&U'!C8","v":"HTC Equity"},null,{"$f":"'Closing S&U'!G8","v":0},null,null,0,null,null,null,null,null,null,null,null,null,null,null,null,null,null,null,null,null,null,null,null,null,null,null,null,null,null,null,null,null,null,null,null,null,null,null,null,null,null,null,null,null,null,null,null,null,0,null,0]
[{"$f":"'Closing S&U'!C9","v":"Other Equity:"},{"$f":"'Closing S&U'!D9","v":0},{"$f":"'Closing S&U'!G9","v":0},null,null,0,null,null,null,null,null,null,null,null,null,null,null,null,null,null,null,null,null,null,null,null,null,null,null,null,null,null,null,null,null,null,null,null,null,null,null,null,null,null,null,null,null,null,null,null,null,0,null,0]
[{"$f":"'Closing S&U'!C10","v":"Developer Fee Loan"},null,{"$f":"'Closing S&U'!G10","v":0},null,null,0,null,null,null,null,null,null,null,null,null,null,null,null,null,null,null,null,null,null,null,null,null,null,null,null,null,null,null,null,null,null,null,null,null,null,null,null,null,null,null,null,null,null,null,null,null,0,null,0]
[{"$f":"'Closing S&U'!C11","v":"Other Source:"},{"$f":"'Closing S&U'!D11","v":0},{"$f":"'Closing S&U'!G11","v":0},null,null,0,null,null,null,null,null,null,null,null,null,null,null,null,null,null,null,null,null,null,null,null,null,null,null,null,null,null,null,null,null,null,null,null,null,null,null,null,null,null,null,null,null,null,null,null,null,0,null,0]
[{"$f":"'Closing S&U'!C15","v":"Grant:"},{"$f":"'Closing S&U'!D15","v":0},{"$f":"'Closing S&U'!F15","v":0},null,null,{"$f":"D11+E11","v":0},null,null,null,null,null,null,null,null,null,null,null,null,null,null,null,null,null,null,null,null,null,null,null,null,null,null,null,null,null,null,null,null,null,null,null,null,null,null,null,null,null,null,null,null,null,0,null,0]
[{"$f":"'Closing S&U'!C16","v":"Grant:"},{"$f":"'Closing S&U'!D16","v":0},{"$f":"'Closing S&U'!F16","v":0},null,null,0,null,null,null,null,null,null,null,null,null,null,null,null,null,null,null,null,null,null,null,null,null,null,null,null,null,null,null,null,null,null,null,null,null,null,null,null,null,null,null,null,null,null,null,null,null,0,null,0]
[{"$f":"'Closing S&U'!C20","v":"NHH Subordinate Loan"},{"$f":"'Closing S&U'!D21","v":0},{"$f":"'Closing S&U'!F21","v":0},null,null,0,null,null,null,null,null,null,null,null,null,null,null,null,null,null,null,null,null,null,null,null,null,null,null,null,null,null,null,null,null,null,null,null,null,null,null,null,null,null,null,null,null,null,null,null,null,0,null,0]
[{"$f":"'Closing S&U'!C22","v":"NHH Subordinate Loan"},{"$f":"'Closing S&U'!D23","v":0},{"$f":"'Closing S&U'!F23","v":0},null,null,0,null,null,null,null,null,null,null,null,null,null,null,null,null,null,null,null,null,null,null,null,null,null,null,null,null,null,null,null,null,null,null,null,null,null,null,null,null,null,null,null,null,null,null,null,null,0,null,0]
[{"$f":"'Closing S&U'!C24","v":"NHH Subordinate Loan"},{"$f":"'Closing S&U'!D25","v":0},{"$f":"'Closing S&U'!F25","v":0},null,null,0,null,null,null,null,null,null,null,null,null,null,null,null,null,null,null,null,null,null,null,null,null,null,null,null,null,null,null,null,null,null,null,null,null,null,null,null,null,null,null,null,null,null,null,null,null,0,null,0]
{"$rows_left_out":109}
{"sheet":"Pro Forma","index":7,"n_rows":222,"n_cols":10,"rows_kept":222,"cut":false,"hidden":false,"merged":[]}
[]
[null,"NH Housing Financing Application",null,null,null,null,null,null,null,"Page 1 of 4"]
[null,{"$f":"'Closing S&U'!A2","v":"Un-named Project"}]
[null,"20-Year Operating Proforma (Years 1-5)"]
[]
[]
[null,null,null,null,null,"Year 1","Year 2","Year 3","Year 4","Year 5"]
[null,null,"INCOME:"]
[null,null,null,{"$f":"'Project Info'!D75","v":"Market Rate"},null,{"$f":"SUM('Inc & Exp'!J7:J12)","v":0},{"$f":"F9*(1+'Inc & Exp'!E122)","v":0},{"$f":"G9*(1+'Inc & Exp'!F122)","v":0},{"$f":"H9*(1+'Inc & Exp'!G122)","v":0},{"$f":"I9*(1+'Inc & Exp'!H122)","v":0}]
[null,null,null,{"$f":"'Project Info'!E75","v":"LIHTC 20% AMI/HTF PBV"},null,{"$f":"SUM('Inc & Exp'!J16:J21)","v":0},{"$f":"F10*(1+'Inc & Exp'!E123)","v":0},{"$f":"G10*(1+'Inc & Exp'!F123)","v":0},{"$f":"H10*(1+'Inc & Exp'!G123)","v":0},{"$f":"I10*(1+'Inc & Exp'!H123)","v":0}]
[null,null,null,{"$f":"'Project Info'!F75","v":"LIHTC 30% AMI/HTF PBV"},null,{"$f":"SUM('Inc & Exp'!J25:J30)","v":0},{"$f":"F11*(1+'Inc & Exp'!E124)","v":0},{"$f":"G11*(1+'Inc & Exp'!F124)","v":0},{"$f":"H11*(1+'Inc & Exp'!G124)","v":0},{"$f":"I11*(1+'Inc & Exp'!H124)","v":0}]
[null,null,null,{"$f":"'Project Info'!G75","v":"LIHTC 60% AMI"},null,{"$f":"SUM('Inc & Exp'!J34:J39)","v":0},{"$f":"F12*(1+'Inc & Exp'!E125)","v":0},{"$f":"G12*(1+'Inc & Exp'!F125)","v":0},{"$f":"H12*(1+'Inc & Exp'!G125)","v":0},{"$f":"I12*(1+'Inc & Exp'!H125)","v":0}]
[null,null,null,{"$f":"'Project Info'!H75","v":"LIHTC 70% AMI"},null,{"$f":"SUM('Inc & Exp'!J43:J48)","v":0},{"$f":"F13*(1+'Inc & Exp'!E126)","v":0},{"$f":"G13*(1+'Inc & Exp'!F126)","v":0},{"$f":"H13*(1+'Inc & Exp'!G126)","v":0},{"$f":"I13*(1+'Inc & Exp'!H126)","v":0}]
[null,null,null,{"$f":"'Project Info'!I75","v":"LIHTC 80% AMI"},null,{"$f":"SUM('Inc & Exp'!J56:J61)","v":0},{"$f":"F14*(1+'Inc & Exp'!E127)","v":0},{"$f":"G14*(1+'Inc & Exp'!F127)","v":0},{"$f":"H14*(1+'Inc & Exp'!G127)","v":0},{"$f":"I14*(1+'Inc & Exp'!H127)","v":0}]
[null,null,null,{"$f":"'Project Info'!J75","v":"Income Limit/Program "},null,{"$f":"SUM('Inc & Exp'!J65:J70)","v":0},{"$f":"F15*(1+'Inc & Exp'!E128)","v":0},{"$f":"G15*(1+'Inc & Exp'!F128)","v":0},{"$f":"H15*(1+'Inc & Exp'!G128)","v":0},{"$f":"I15*(1+'Inc & Exp'!H128)","v":0}]
{"$rows_left_out":208}
{"sheet":"Dev Fee","index":8,"n_rows":45,"n_cols":23,"rows_kept":45,"cut":false,"hidden":false,"merged":[[0,0,0,3],[41,0,41,1]]}
["Developer Fee Schedule"]
[]
["Project Name",{"$f":"'Project Info'!E3","v":0}]
[]
[null,"Developer Fees"]
[]
["The developer fee is not a guaranteed or automatic budgetary figure, and must be approved by the Authority"]
["within the context of each project.  The fee will be strictly limited, with any violations of the developer"]
["certification of development cost forwarded to the IRS using IRS form 8823.  For purposes of calculating the"]
["maximum developer fee allowed, the Authority does not distinguish between the developer fee and fees for"]
["consultants doing those tasks typically done by a developer, regardless of whether the applicant is a for-"]
["profit or non-profit entity.  \"Consultant fees\" counted as developer fee do not include professional fees such"]
["as architectural, engineering, or appraisal fees."]
[]
["Maximum Developer Fee Calculation"]
{"$rows_left_out":31}
{"sheet":"Sheet1","index":9,"n_rows":19,"n_cols":3,"rows_kept":19,"cut":false,"hidden":true,"merged":[]}
["Income Limit/Program "]
["LIHTC 20% AMI",null,"NHH AHF Loan"]
["LIHTC 30% AMI","Yes","NHH HOME Loan"]
["LIHTC 40% AMI","No","NHH HOME-ARP Loan"]
["LIHTC 50% AMI",null,"NHH HTF Loan"]
["LIHTC 60% AMI",null,"NHH InvestNH Loan"]
["LIHTC 70% AMI",null,"NHH Other Loan"]
["LIHTC 80% AMI"]
["LIHTC 30% AMI/HTF"]
["LIHTC 50% AMI/LOW HOME"]
["LIHTC 60% AMI/HIGH HOME"]
["LIHTC 20% AMI PBV"]
["LIHTC 30% AMI PBV"]
["LIHTC 40% AMI PBV"]
["LIHTC 50% AMI PBV"]
{"$rows_left_out":5}
{"sheet":"Gap Analysis","index":10,"n_rows":39,"n_cols":4,"rows_kept":39,"cut":false,"hidden":true,"merged":[]}
[{"$f":"'Project Info'!E3","v":0}]
[null,"LIHTC GAP ANALYSIS"]
[]
[]
["Note: For use by NH Housing Only"]
[]
["EQUITY GAP DETERMINATION"]
[]
["Total Sources of Mortgage Debt ",null,null,{"$f":"'Closing S&U'!F20+'Closing S&U'!F22+'Closing S&U'!F24+'Closing S&U'!F26+'Closing S&U'!F28+'Closing S&U'!F35+'Closing S&U'!F36+'Closing S&U'!F38","v":0}]
["Developer fee loan",null,null,{"$f":"'Closing S&U'!G10","v":0}]
["Grants",null,null,{"$f":"'Closing S&U'!F15+'Closing S&U'!F16","v":0}]
["Other ",null,null,{"$f":"'Closing S&U'!G11","v":0}]
["     Total Non-Credit Sources of Funds",null,null,{"$f":"SUM(D9:D12)","v":0}]
[]
["Total Equity Needed",null,null,{"$f":"'LIHTC Info'!E197","v":0}]
{"$rows_left_out":25}
{"sheet":"Exh A","index":11,"n_rows":135,"n_cols":8,"rows_kept":135,"cut":false,"hidden":true,"merged":[]}
[null,null,"9% credit",null,0.09,null,"Total 9% Basis",{"$f":"'LIHTC Info'!H197","v":0}]
["Credit Rate Assumptions:",null,"4% credit",null,{"$f":"'LIHTC Info'!H14","v":0.04},null,"Total 4% Basis",{"$f":"'LIHTC Info'!G197","v":0}]
[null,null,"Month of Lock In (for 4% Acq. Credits)",null,{"$f":"1/2020","v":"00:00:42.772"},null,"Total # of Buildings",{"$f":"'Project Info'!I123","v":0}]
[]
["Carryover Allocation Agreement - Exhibit A",null,null,null,null,"Table Page 1 of  1"]
[]
["Project Name:",{"$f":"'Project Info'!E3:I3","v":{"$error":"#VALUE!"}}]
[]
["Building BIN #","NH-11-00000","NH-11-00000","NH-11-00000","NH-11-00000","NH-11-00000","NH-11-00000","Total"]
["Building Address or"]
["Site Description"]
[]
["Building Type: New Construction"]
[" Rehab or Acquisition","New Construct",{"$f":"B14","v":"New Construct"},{"$f":"B14","v":"New Construct"},{"$f":"B14","v":"New Construct"},{"$f":"B14","v":"New Construct"},{"$f":"B14","v":"New Construct"}]
[]
{"$rows_left_out":121}
{"sheet":"Risk Sharing","index":12,"n_rows":341,"n_cols":3,"rows_kept":341,"cut":false,"hidden":true,"merged":[]}
["NHHFA","Sources and Uses of Funds"]
["Section 911 Subsidy Layering Review"]
[]
["Project Name:",{"$f":"'Project Info'!E3","v":0}]
["NHHFA Project No.:"]
[]
["SOURCES"]
["Debt Sources:"]
["HUD Loans/programs (HOME)"]
["Other Government Assistance"]
["Other Loans"]
["   NHHFA Tax Exempt Bond",0]
["   Deferred Developer Fee",0]
["   Other"]
["Debt Subtotal",0]
{"$rows_left_out":327}
{"sheet":"Change Log","index":13,"n_rows":32,"n_cols":3,"rows_kept":32,"cut":false,"hidden":true,"merged":[]}
["Change Date","Item","Notes"]
["2019-02-21","Fixed Control C macro error","No more errors,  Ctrl+c now works."]
["2019-02-21","Renamed tabs to ease navigation & colored based on project type","Not married to these names, however, we should be more descriptive on what the tabs are"]
["2019-02-21","Added instruction tab","This will help alleviate some questions on what to fill out for different project types"]
["2018-04-09","Updated tabs for income averaging"]
["2018-04-09","Changed active X controls","Application can be edited online now"]
["2019-04-09","Deleted print summary tab"]
["2019-04-09","Increased the developer fee 12%","Cleaned up writing on tab, naming of project type. Will delete on publishing."]
["2019-04-09","Change font on application tabs"]
["2019-04-15","Changes to the Gap Analysis tab & Exh A "]
["2019-04-15","Add additional cagetories to professional fees.  Renamed category."]
["2019-04-15","Added upfront MIP, trustee fee, and application fee to Financing Fees and Expenses"]
["2019-04-23","Split financial page into three tabs"]
["2019-04-23","Updated income bands on rent tab to auto poplulate"]
["2019-04-23","Cleaned up broken links, formulas.  "]
{"$rows_left_out":18}
{"sheet":"Module1","index":14,"n_rows":0,"n_cols":0,"rows_kept":0,"cut":false,"hidden":true,"merged":[]}

{"sheet":"Module2","index":15,"n_rows":0,"n_cols":0,"rows_kept":0,"cut":false,"hidden":true,"merged":[]}