{"text_format":"1","workbook":"xlsx","n_sheets":13,"sheets":["Instructions","Project Info","Dev Team","Closing S&U","Inc & Exp","Pro Forma","Sheet1","Gap Analysis","Exh A","Risk Sharing","Change Log","Module1","Module2"],"not_rendered":{"charts":0,"images":0,"macros":0,"external_links":1,"defined_names":89,"comments":0,"pivot_tables":0},"unopened":[],"bounds":{"document_bytes":16777216,"sheet_cells":100000,"rows_first":2000,"rows_last":500,"rows_between":2000,"halvings":0,"cell_chars":16384,"cell_head_chars":4096},"cells_cut":0,"cells_raw":0,"read":"whole","date_system":"1900"}

{"sheet":"Instructions","index":0,"n_rows":23,"n_cols":3,"rows_kept":23,"cut":false,"hidden":false,"merged":[[0,0,0,7],[1,0,1,7]]}
["New Hampshire Housing Financing Application - Supportive Housing Program - FY 2025"]
[]
[]
[null,"All sections of the applicationmust be completed in full.  Staff reserves the right to reject partially completed applications."]
[]
[null,"Please ensure that when submitting the completed application, that Section 2 of the Development Team tab is"]
[null,"signed."]
[]
[]
[null,"Details for each tab:"]
[]
[null,"Dev Team","This tab captures the members of the project's development team."]
[]
[null,"Project Info","This tab is used to gather general information about the project, including unit details"]
[null,null,"and building features."]
[]
[null,"Closing S&U","This tab details the project financing sources and uses. "]
[]
[null,"Inc & Exp","This tab captures rent and other income information, operating expenses, and debt service. "]
[null,null,"Please use the FY 2025 HUD rent limits found on NH Housing's Website, and the maximum rents for "]
[null,null,"shared bedrooms and SRO units found in the FY 25 Supportive Housing NOFO, to complete this section. "]
[]
[null,"Pro Forma","This tab automatically populated and is used to analyze  income/expense trending."]

{"sheet":"Project Info","index":1,"n_rows":268,"n_cols":10,"rows_kept":268,"cut":false,"hidden":false,"merged":[[170,3,172,8],[2,4,2,8],[3,4,3,8],[4,4,4,6],[18,2,25,8],[90,2,97,8],[247,5,247,6],[242,4,242,8],[244,4,244,8],[245,4,246,8],[174,3,176,8],[178,3,180,8],[183,3,184,8],[238,4,238,5],[205,2,206,8],[195,5,195,8],[243,7,243,8]]}
["PROJECT INFORMATION"]
[]
[1,".","Project Name:"]
[{"$f":"A3+1","v":2},".","Project Address:"]
[{"$f":"A4+1","v":3},".","Project Community:",null,null,null,null,"                NH"]
[null,null,null,null,"                                    (city/town)",null,null,"(state)","(zip code)"]
[]
["Development Plan"]
[]
[4,".","Development Type (please check all that apply):"]
[null,{"$f":"IF(LEN(TRIM(G11))>0,1,0)","v":{"$error":"#VALUE!"}},"   New construction",null,null,null,null,"Mark with an \"X\""]
[null,{"$f":"IF(LEN(TRIM(G12))>0,1,0)","v":{"$error":"#VALUE!"}},"   Acquisition and rehabilitation of existing housing",null,null,null,null,"Mark with an \"X\""]
[null,{"$f":"IF(LEN(TRIM(G13))>0,1,0)","v":{"$error":"#VALUE!"}},"   Acquisition, minimal or no rehab of existing housing",null,null,null,null,"Mark with an \"X\""]
[null,{"$f":"IF(LEN(TRIM(G14))>0,1,0)","v":{"$error":"#VALUE!"}},"   Other",null,null,null,null,"Mark with an \"X\""]
[]
[5,".","Project Description:"]
[null,null,"Please describe the proposed project in a few sentences.  Indicate the population served and the type and number of "]
[null,null,"housing units.  Describe the current condition of the site and its  ownership.  Note whether the site is distressed. "]
[]
[]
[]
[]
[]
[]
[]
[]
[]
[6,".","Funding Applied For:"]
[null,null,"Please indicate the funding that is being applied for at this time with this application:"]
[null,null,null,null,null,null,"Yes or No ","Amount "]
{"$rows_left_out":239}
{"sheet":"Dev Team","index":2,"n_rows":142,"n_cols":10,"rows_kept":142,"cut":false,"hidden":false,"merged":[[64,5,64,8],[65,5,65,8],[66,5,66,8],[51,5,51,8],[57,5,57,8],[60,5,60,6],[60,7,60,8],[58,5,58,8],[59,5,59,8],[56,5,56,8],[101,3,111,8],[63,5,63,8],[81,5,81,8],[67,5,67,8],[96,5,96,6],[96,7,96,8],[76,5,76,8],[93,5,93,8],[94,5,94,8],[95,5,95,8],[77,5,77,8],[82,5,82,8],[86,5,86,6],[86,7,86,8],[78,5,78,6],[78,7,78,8],[34,5,34,8],[13,5,13,8],[12,5,12,8],[32,5,32,8],[40,5,40,8],[14,5,14,8],[24,5,24,8],[39,5,39,8],[15,5,15,6],[36,5,36,6],[36,7,36,8],[48,5,48,8],[49,5,49,8],[43,5,43,8],[55,5,55,8],[35,5,35,8],[52,5,52,6],[52,7,52,8],[44,5,44,6],[44,7,44,8],[50,5,50,8],[42,5,42,8],[47,5,47,8],[41,5,41,8],[0,0,0,9],[31,5,31,8],[33,5,33,8],[7,3,7,5],[23,5,23,8],[25,7,25,8],[25,5,25,6],[18,5,18,8],[19,5,19,8],[20,5,20,8],[21,5,21,8],[22,5,22,8],[1,3,1,7],[10,5,10,8],[11,5,11,8],[15,7,15,8],[91,5,91,8],[92,5,92,8],[73,5,73,8],[75,5,75,8],[68,5,68,6],[68,7,68,8],[85,5,85,8],[83,5,83,8],[84,5,84,8],[74,5,74,8]]}
["DEVELOPMENT TEAM SUMMARY"]
[null,null,null,{"$f":"'Closing S&U'!A2","v":"Un-named Project"}]
[]
[1,".","Developer/Sponsor Type (Please check one box)",null,null,null,null,"(check one)"]
[null,null,"         Any form of for-profit corporation, partnership, or individual",null,null,null,null,null,null,{"$f":"IF(H5<>\" \",1,0)","v":0}]
[null,null,"         Non-profit corporation",null,null,null,null,null,null,{"$f":"IF(H6<>\" \",1,0)","v":0}]
[null,null,"         Limited equity housing cooperative",null,null,null,null," ",null,{"$f":"IF(H7<>\" \",1,0)","v":0}]
[null,null,"         Other:     ",null,null,null,null," ",null,{"$f":"IF(H8<>\" \",1,0)","v":0}]
[]
[{"$f":"A4+1","v":2},".","Developer/Sponsor:",null," "]
[null,null,null,"Legal Name"]
[null,null,null,"Address"]
[]
[null,null,null,"Contact Person"]
[null,null,null,"Email Address"]
[null,null,null,"Telephone No.  /  Fax. No."]
[]
[{"$f":"A10+1","v":3},".","Proposed Owner/Mortgagor:"]
[null,null,null,"Form of Legal Entity"]
[null,null,null,"Legal Name"]
[null,null,null,"Address"]
[]
[null,null,null,"Principals"]
[null,null,null,"Contact Person"]
[null,null,null,"Email Address"]
[null,null,null,"Telephone No.  /  Fax. No."]
[]
[]
[]
[]
{"$rows_left_out":113}
{"sheet":"Closing S&U","index":3,"n_rows":123,"n_cols":10,"rows_kept":123,"cut":false,"hidden":false,"merged":[[0,0,0,9],[104,7,104,8],[2,0,2,9],[1,0,1,9],[117,7,117,8],[31,7,31,8],[32,7,32,8],[33,7,33,8],[34,7,34,8],[37,7,37,8],[38,7,38,8],[40,7,40,8],[41,7,41,8],[42,7,42,8],[43,7,43,8],[58,7,58,8],[62,7,62,8],[63,7,63,8],[113,7,113,8],[114,7,114,8],[85,7,85,8],[77,7,77,8],[78,7,78,8],[79,7,79,8],[100,7,100,8],[101,7,101,8],[86,7,86,8],[87,7,87,8],[88,7,88,8],[89,7,89,8],[90,7,90,8],[96,7,96,8],[115,7,115,8],[116,7,116,8],[110,7,110,8],[9,3,9,4],[10,3,10,4],[11,3,11,4],[12,3,12,4],[105,7,105,8],[24,4,24,8],[25,4,25,8],[54,7,54,8],[55,7,55,8],[56,7,56,8],[57,7,57,8],[13,3,13,4],[15,2,15,4],[4,3,4,4],[5,3,5,4],[6,3,6,4],[7,3,7,4],[8,3,8,4],[16,2,16,5],[17,3,17,4],[18,3,18,4],[19,2,19,4],[29,7,29,8],[30,7,30,8],[49,2,49,3],[49,7,49,8],[51,7,51,8],[52,7,52,8],[53,7,53,8],[82,7,82,8],[83,7,83,8],[84,7,84,8],[64,7,64,8],[65,7,65,8],[66,7,66,8],[67,7,67,8],[68,7,68,8],[69,7,69,8],[70,7,70,8],[73,7,73,8],[74,7,74,8],[75,7,75,8],[76,7,76,8],[61,7,61,8],[97,7,97,8],[98,7,98,8],[99,7,99,8],[91,7,91,8],[92,7,92,8],[93,7,93,8],[94,7,94,8],[95,7,95,8]]}
["CLOSING SOURCES AND USES OF FUNDS"]
[{"$f":"IF(+'Project Info'!E3=\"\",\"Un-named Project\",+'Project Info'!E3)","v":"Un-named Project"}]
["Sources of Funds"]
[]
[1,null,"Type of Funding","Source of Funding",null,"Amount  $"]
[null,".","Developer Fee Loan","N/A"]
[null,".","Developer's Cash Equity"]
[null,".","Other Equity"]
[null,".","Other Equity"]
[null,null,"Grant"]
[null,".","Grant"]
[null,".","Grant",null,null,null,"Rate %","Amortize (years)","Term (years)","Lien Position"]
[null,null,"NHH Capital Subsidy (Deferred Payment) Loan","NH Housing Afforable Housing Fund",null,null,0,"N/A",30]
[null,".","NHH Long-Term Loan","NH Housing"]
[null,null,"Other Long-Term Loan"]
[null,null,"Total Long-Term Sources",null,null,{"$f":"SUM(F6:F15)","v":0}]
[null,null,null,null,null,null,"Rate  %","Term (months)","Lien Position"]
[null,".","Construction Loan"]
[null,".","Other Bridge Financing"]
[null,null,"Total Construction Only Sources",null,null,{"$f":"SUM(F18:F19)","v":0}]
[]
[]
[null,null,"Uses of Funds"]
[null,null,"Direct Construction:"]
[2,".","Who prepared the estimates?"]
[{"$f":"A25+1","v":3},".","What is basis for estimates?"]
[]
[]
[null,null,"Development Budget:"]
[]
{"$rows_left_out":94}
{"sheet":"Inc & Exp","index":4,"n_rows":145,"n_cols":10,"rows_kept":145,"cut":false,"hidden":false,"merged":[[72,6,72,7],[56,7,56,8],[58,7,58,8],[69,6,69,7],[0,0,0,9],[1,0,1,9],[3,0,3,9],[70,6,70,7],[71,6,71,7],[64,7,64,8],[62,7,62,8]]}
["OPERATING PRO-FORMA"]
[{"$f":"'Closing S&U'!A2","v":"Un-named Project"}]
[]
["Operating Income"]
[null,null,"Rent Schedule:"]
[1,null,{"$f":"'Project Info'!D54","v":"Market Rate"},"FMR","Contract Rent","Utility Allowance","Gross Rent","# of Units ","Total Beds","Annual Rent"]
[null,null,"Shared bedroom units",null,null,null,{"$f":"E7+F7","v":0},{"$f":"'Project Info'!D55","v":0},{"$f":"'Project Info'!D86","v":0},{"$f":"(E7*I7)*12","v":0}]
[null,null,"SRO",null,null,null,{"$f":"E8+F8","v":0},{"$f":"'Project Info'!D56","v":0},"--",{"$f":"(E8*H8)*12","v":0}]
[null,null,"0 Bedroom",null,null,null,{"$f":"E9+F9","v":0},{"$f":"'Project Info'!D56","v":0},"--",{"$f":"(E9*H9)*12","v":0}]
[null,null,"1 Bedroom",null,null,null,0,{"$f":"'Project Info'!D57","v":0},"--",0]
[null,null,"2 Bedroom",null,null,null,{"$f":"E11+F11","v":0},{"$f":"'Project Info'!D58","v":0},"--",0]
[null,null,"3 Bedroom",null,null,null,0,{"$f":"'Project Info'!D59","v":0},"--",0]
[null,null,"4 Bedroom",null,null,null,{"$f":"E13+F13","v":0},{"$f":"'Project Info'!D60","v":0},"--",{"$f":"(E13*H13)*12","v":0}]
[null,null,null,null,null,null,null,null,"Subtotal",{"$f":"SUM(J7:J13)","v":0}]
[]
[2,null,{"$f":"'Project Info'!E54","v":"30% AMI"},"Rent Limit","Contract Rent","Utility Allowance","Gross Rent","# of Units ","Total Beds","Annual Rent"]
[null,null,"Shared bedroom units",null,null,null,{"$f":"E17+F17","v":0},{"$f":"'Project Info'!E55","v":0},{"$f":"'Project Info'!E86","v":0},{"$f":"(E17*I17)*12","v":0}]
[null,null,"SRO",null,null,null,{"$f":"E18+F18","v":0},{"$f":"'Project Info'!E56","v":0},"--",{"$f":"(E18*H18)*12","v":0}]
[null,null,"0 Bedroom",null,null,null,{"$f":"E19+F19","v":0},{"$f":"'Project Info'!E57","v":0},"--",{"$f":"(E19*H19)*12","v":0}]
[null,null,"1 Bedroom",null,null,null,0,{"$f":"'Project Info'!E58","v":0},"--",0]
[null,null,"2 Bedroom",null,null,null,{"$f":"E21+F21","v":0},{"$f":"'Project Info'!E59","v":0},"--",0]
[null,null,"3 Bedroom",null,null,null,{"$f":"E22+F22","v":0},{"$f":"'Project Info'!E60","v":0},"--",0]
[null,null,"4 Bedroom",null,null,null,{"$f":"E23+F23","v":0},{"$f":"'Project Info'!E61","v":0},"--",{"$f":"(E23*H23)*12","v":0}]
[null,null,null,null,null,null,null,null,"Subtotal",{"$f":"SUM(J17:J23)","v":0}]
[]
[3,null,{"$f":"'Project Info'!F54","v":"50% AMI"},"Rent Limit","Contract Rent","Utility Allowance","Gross Rent","# of Units ","Total Beds","Annual Rent"]
[null,null,"Shared bedroom units",null,null,null,{"$f":"E27+F27","v":0},{"$f":"'Project Info'!F55","v":0},{"$f":"'Project Info'!F86","v":0},{"$f":"(E27*I27)*12","v":0}]
[null,null,"SRO",null,null,null,{"$f":"E28+F28","v":0},{"$f":"'Project Info'!F56","v":0},"--",{"$f":"(E28*H28)*12","v":0}]
[null,null,"0 Bedroom",null,null,null,{"$f":"E29+F29","v":0},{"$f":"'Project Info'!F57","v":0},"--",{"$f":"(E29*H29)*12","v":0}]
[null,null,"1 Bedroom",null,null,null,0,{"$f":"'Project Info'!F58","v":0},"--",0]
{"$rows_left_out":116}
{"sheet":"Pro Forma","index":5,"n_rows":61,"n_cols":14,"rows_kept":61,"cut":false,"hidden":false,"merged":[[5,12,5,13]]}
[]
[null,"NH Housing Financing Application"]
[null,{"$f":"'Closing S&U'!A2","v":"Un-named Project"}]
[null,"20-Year Operating Proforma (Years 1-5)"]
[]
[null,null,null,null,null,null,null,null,null,null,null,null,"Trending Assumptions"]
[null,null,null,null,null,"Year 1","Year 2","Year 3","Year 4","Year 5",null,null,"Vacancy",0.05]
[null,null,null,null,null,null,null,null,null,null,null,null,"Income",0.02]
[null,null,"Effective Gross Income",null,null,{"$f":"'Inc & Exp'!J77","v":0},{"$f":"F9*(1+N8)","v":0},{"$f":"G9*(1+N8)","v":0},{"$f":"H9*(1+N8)","v":0},{"$f":"I9*(1+N8)","v":0},null,null,"Expenses",0.03]
[null,null,"Total Operating Expenses",null,null,{"$f":"'Inc & Exp'!G133","v":0},{"$f":"F10*(1+N9)","v":0},{"$f":"G10*(1+N9)","v":0},{"$f":"H10*(1+N9)","v":0},{"$f":"I10*(1+N9)","v":0}]
[null,null,"NET OPERATING INCOME",null,null,{"$f":"F9-F10","v":0},{"$f":"G9-G10","v":0},0,0,0]
[]
[null,null,"Debt Service",null,null,{"$f":"'Inc & Exp'!G141","v":0},{"$f":"'Inc & Exp'!G141","v":0},{"$f":"'Inc & Exp'!G141","v":0},{"$f":"'Inc & Exp'!G141","v":0},{"$f":"'Inc & Exp'!G141","v":0}]
[null,null,"Debt Service Coverage",null,null,{"$f":"IF(F13>0,F11/F13,\"\")","v":""},{"$f":"IF(G13>0,G11/G13,\"               \")","v":"               "},{"$f":"IF(H13>0,H11/H13,\"               \")","v":"               "},{"$f":"IF(I13>0,I11/I13,\"               \")","v":"               "},{"$f":"IF(J13>0,J11/J13,\"               \")","v":"               "}]
[null,null,"Project Cash Flow",null,null,{"$f":"F11-F13","v":0},{"$f":"G11-G13","v":0},{"$f":"H11-H13","v":0},{"$f":"I11-I13","v":0},{"$f":"J11-J13","v":0}]
[null,null,"Operating Expense Ratio",null,null,{"$f":"F10/F9","v":{"$error":"#DIV/0!"}},{"$f":"G10/G9","v":{"$error":"#DIV/0!"}},{"$f":"H10/H9","v":{"$error":"#DIV/0!"}},{"$error":"#DIV/0!"},{"$error":"#DIV/0!"}]
[]
[null,{"$f":"B2","v":"NH Housing Financing Application"}]
[null,"20-Year Operating Proforma (Years 6-10)"]
[]
[]
[null,null,null,null,null,"Year 6","Year 7","Year 8","Year 9","Year 10"]
[]
[null,null,"Effective Gross Income",null,null,{"$f":"J9*(1+N8)","v":0},{"$f":"F24*(1+N8)","v":0},{"$f":"G24*(1+N8)","v":0},{"$f":"H24*(1+N8)","v":0},{"$f":"I24*(1+N8)","v":0}]
[null,null,"Total Operating Expenses",null,null,{"$f":"J10*(1+N9)","v":0},{"$f":"F25*(1+N9)","v":0},{"$f":"G25*(1+N9)","v":0},{"$f":"H25*(1+N9)","v":0},{"$f":"I25*(1+N9)","v":0}]
[null,null,"NET OPERATING INCOME",null,null,{"$f":"F24-F25","v":0},{"$f":"G24-G25","v":0},{"$f":"H24-H25","v":0},{"$f":"I24-I25","v":0},{"$f":"J24-J25","v":0}]
[]
[null,null,"Debt Service",null,null,{"$f":"'Inc & Exp'!G141","v":0},{"$f":"'Inc & Exp'!G141","v":0},{"$f":"'Inc & Exp'!G141","v":0},{"$f":"'Inc & Exp'!G141","v":0},{"$f":"'Inc & Exp'!G141","v":0}]
[null,null,"Debt Service Coverage",null,null,{"$f":"IF(F28>0,F26/F28,\"\")","v":""},{"$f":"IF(G28>0,G26/G28,\"               \")","v":"               "},{"$f":"IF(H28>0,H26/H28,\"               \")","v":"               "},{"$f":"IF(I28>0,I26/I28,\"               \")","v":"               "},{"$f":"IF(J28>0,J26/J28,\"               \")","v":"               "}]
[null,null,"Project Cash Flow",null,null,{"$f":"F26-F28","v":0},{"$f":"G26-G28","v":0},{"$f":"H26-H28","v":0},{"$f":"I26-I28","v":0},{"$f":"J26-J28","v":0}]
{"$rows_left_out":32}
{"sheet":"Sheet1","index":6,"n_rows":19,"n_cols":3,"rows_kept":19,"cut":false,"hidden":true,"merged":[]}
["Income Limit/Program "]
["LIHTC 20% AMI",null,"NHH AHF Loan"]
["LIHTC 30% AMI","Yes","NHH HOME Loan"]
["LIHTC 40% AMI","No","NHH HOME-ARP Loan"]
["LIHTC 50% AMI",null,"NHH HTF Loan"]
["LIHTC 60% AMI",null,"NHH InvestNH Loan"]
["LIHTC 70% AMI",null,"NHH Other Loan"]
["LIHTC 80% AMI"]
["LIHTC 30% AMI/HTF"]
["LIHTC 50% AMI/LOW HOME"]
["LIHTC 60% AMI/HIGH HOME"]
["LIHTC 20% AMI PBV"]
["LIHTC 30% AMI PBV"]
["LIHTC 40% AMI PBV"]
["LIHTC 50% AMI PBV"]
["LIHTC 20% AMI/HTF PBV"]
["LIHTC 30% AMI/HTF PBV"]
["LIHTC 50% AMI/LOW HOME PBV"]
["LIHTC 30% Section 811"]

{"sheet":"Gap Analysis","index":7,"n_rows":39,"n_cols":4,"rows_kept":39,"cut":false,"hidden":true,"merged":[]}
[{"$f":"'Project Info'!E3","v":0}]
[null,"LIHTC GAP ANALYSIS"]
[]
[]
["Note: For use by NH Housing Only"]
[]
["EQUITY GAP DETERMINATION"]
[]
["Total Sources of Mortgage Debt ",null,null,{"$f":"'Closing S&U'!#REF!+'Closing S&U'!#REF!+'Closing S&U'!#REF!+'Closing S&U'!#REF!+'Closing S&U'!#REF!+'Closing S&U'!#REF!+'Closing S&U'!#REF!+'Closing S&U'!#REF!","v":{"$error":"#REF!"}}]
["Developer fee loan",null,null,{"$f":"'Closing S&U'!#REF!","v":{"$error":"#REF!"}}]
["Grants",null,null,{"$f":"'Closing S&U'!#REF!+'Closing S&U'!#REF!","v":{"$error":"#REF!"}}]
["Other ",null,null,{"$f":"'Closing S&U'!#REF!","v":{"$error":"#REF!"}}]
["     Total Non-Credit Sources of Funds",null,null,{"$f":"SUM(D9:D12)","v":{"$error":"#REF!"}}]
[]
["Total Equity Needed",null,null,{"$f":"#REF!","v":{"$error":"#REF!"}}]
[]
["Historic Tax Credits (20% of elig historic basis)",null,{"$f":"#REF!","v":{"$error":"#REF!"}}]
["     Historic Tax Credit purchase rate:",null,{"$f":"#REF!","v":{"$error":"#REF!"}}]
["   Calculated Equity from Historic Tax Credits",null,null,{"$f":"C18*C17","v":{"$error":"#REF!"}}]
[]
["Equity Needed from LIHTC",null,null,{"$f":"D15-D19","v":{"$error":"#REF!"}}]
[]
["30 Percent PV Credit Rate","Total Acquis Credit Allowable",null,{"$f":"#REF!","v":{"$error":"#REF!"}}]
["   Assumed Credit Rate:",{"$f":"#REF!","v":{"$error":"#REF!"}}]
[]
["QCT/DDA Credit Rate Allowed","Yes=1.3, No=0",null,{"$f":"IF(#REF!=\"yes\",1.3,0)","v":{"$error":"#REF!"}}]
["If Yes, Rehab/Construct Basis increased to 130% of Eligible Basis"]
[]
["70 Percent PV Credit Rate","Total Rehab Credit Allowable",null,{"$f":"IF(D26=1.3,+(#REF!*B30*D26),(#REF!*B30))","v":{"$error":"#REF!"}}]
["   Assumed Credit Rate:",{"$f":"#REF!","v":{"$error":"#REF!"}}]
{"$rows_left_out":10}
{"sheet":"Exh A","index":8,"n_rows":135,"n_cols":8,"rows_kept":135,"cut":false,"hidden":true,"merged":[]}
[null,null,"9% credit",null,0.09,null,"Total 9% Basis",{"$f":"#REF!","v":{"$error":"#REF!"}}]
["Credit Rate Assumptions:",null,"4% credit",null,{"$f":"#REF!","v":{"$error":"#REF!"}},null,"Total 4% Basis",{"$f":"#REF!","v":{"$error":"#REF!"}}]
[null,null,"Month of Lock In (for 4% Acq. Credits)",null,{"$f":"1/2020","v":"00:00:42.772"},null,"Total # of Buildings",{"$f":"'Project Info'!I105","v":0}]
[]
["Carryover Allocation Agreement - Exhibit A",null,null,null,null,"Table Page 1 of  1"]
[]
["Project Name:",{"$f":"'Project Info'!E3:I3","v":{"$error":"#VALUE!"}}]
[]
["Building BIN #","NH-11-00000","NH-11-00000","NH-11-00000","NH-11-00000","NH-11-00000","NH-11-00000","Total"]
["Building Address or"]
["Site Description"]
[]
["Building Type: New Construction"]
[" Rehab or Acquisition","New Construct",{"$f":"B14","v":"New Construct"},{"$f":"B14","v":"New Construct"},{"$f":"B14","v":"New Construct"},{"$f":"B14","v":"New Construct"},{"$f":"B14","v":"New Construct"}]
[]
["Expected Placed"]
["in Service Date",{"$f":"1/0/0","v":{"$error":"#DIV/0!"}},{"$f":"B17","v":{"$error":"#DIV/0!"}},{"$f":"C17","v":{"$error":"#DIV/0!"}},{"$f":"D17","v":{"$error":"#DIV/0!"}},{"$f":"E17","v":{"$error":"#DIV/0!"}},{"$f":"F17","v":{"$error":"#DIV/0!"}}]
[]
["Reasonably Anticipated"]
["Eligible Basis ",{"$f":"$H$1/$H$3","v":{"$error":"#REF!"}},{"$error":"#REF!"},{"$error":"#REF!"},{"$error":"#REF!"},{"$error":"#REF!"},{"$error":"#REF!"}]
[]
["Eligible for DDA/QCT?",{"$f":"IF(#REF!=\"\",\"\",#REF!)","v":{"$error":"#REF!"}},{"$f":"B22","v":{"$error":"#REF!"}},{"$f":"C22","v":{"$error":"#REF!"}},{"$f":"D22","v":{"$error":"#REF!"}},{"$f":"E22","v":{"$error":"#REF!"}},{"$f":"F22","v":{"$error":"#REF!"}}]
["Adjusted Eligible Basis",{"$f":"IF(B22=\"yes\",($A$24*B20),B20)","v":{"$error":"#REF!"}},{"$error":"#REF!"},{"$error":"#REF!"},{"$error":"#REF!"},{"$error":"#REF!"},{"$error":"#REF!"}]
[1.3]
["Estimated Applicable"]
["Fraction**",{"$f":"#REF!","v":{"$error":"#REF!"}},{"$f":"B26","v":{"$error":"#REF!"}},{"$f":"B26","v":{"$error":"#REF!"}},{"$f":"B26","v":{"$error":"#REF!"}},{"$f":"B26","v":{"$error":"#REF!"}},{"$f":"B26","v":{"$error":"#REF!"}}]
[]
["Estimated Qualified Basis",{"$f":"B23*B26","v":{"$error":"#REF!"}},{"$error":"#REF!"},{"$error":"#REF!"},{"$error":"#REF!"},{"$error":"#REF!"},{"$error":"#REF!"}]
[]
["Maximum Credit Percentage ***",{"$f":"$E$1","v":0.09},0.09,0.09,0.09,0.09,0.09]
{"$rows_left_out":106}
{"sheet":"Risk Sharing","index":9,"n_rows":341,"n_cols":3,"rows_kept":341,"cut":false,"hidden":true,"merged":[]}
["NHHFA","Sources and Uses of Funds"]
["Section 911 Subsidy Layering Review"]
[]
["Project Name:",{"$f":"'Project Info'!E3","v":0}]
["NHHFA Project No.:"]
[]
["SOURCES"]
["Debt Sources:"]
["HUD Loans/programs (HOME)"]
["Other Government Assistance"]
["Other Loans"]
["   NHHFA Tax Exempt Bond",0]
["   Deferred Developer Fee",0]
["   Other"]
["Debt Subtotal",0]
[]
["Equity:"]
["Grants"]
["Estimated Net Syndication Proceeds",0]
["Additional Sponsor Equity - Investsment Earnings",0]
["Other Equity Sources"]
["Equity Subtotal",0]
["TOTAL SOURCES",0]
[]
[]
["USES"]
[]
["Mortgageable Replacement Cost Uses"]
["Acquisition",0]
["Construction",0]
{"$rows_left_out":312}
{"sheet":"Change Log","index":10,"n_rows":32,"n_cols":3,"rows_kept":32,"cut":false,"hidden":true,"merged":[]}
["Change Date","Item","Notes"]
["2019-02-21","Fixed Control C macro error","No more errors,  Ctrl+c now works."]
["2019-02-21","Renamed tabs to ease navigation & colored based on project type","Not married to these names, however, we should be more descriptive on what the tabs are"]
["2019-02-21","Added instruction tab","This will help alleviate some questions on what to fill out for different project types"]
["2018-04-09","Updated tabs for income averaging"]
["2018-04-09","Changed active X controls","Application can be edited online now"]
["2019-04-09","Deleted print summary tab"]
["2019-04-09","Increased the developer fee 12%","Cleaned up writing on tab, naming of project type. Will delete on publishing."]
["2019-04-09","Change font on application tabs"]
["2019-04-15","Changes to the Gap Analysis tab & Exh A "]
["2019-04-15","Add additional cagetories to professional fees.  Renamed category."]
["2019-04-15","Added upfront MIP, trustee fee, and application fee to Financing Fees and Expenses"]
["2019-04-23","Split financial page into three tabs"]
["2019-04-23","Updated income bands on rent tab to auto poplulate"]
["2019-04-23","Cleaned up broken links, formulas.  "]
["2019-04-23","Updated construction tab for a 24 month construction period."]
["2019-04-30","Updated LIHTC boost language rows 14 & 20 on the LIHTC tab"]
["2019-04-30","Moved basis/not in basis warning to top of development budget/basis calculation section."]
["2019-04-30","Added row 31 & 31 on the LIHTC tab"]
["2019-04-30","Broke out equity types in sources.  Linked to LIHTC tab.  "]
["2019-04-30","Removed reference to max LIHTC's for a GO."]
["2019-04-30","Removed developer fee calc on Closing S&U tab - was only pulling GO"]
["2019-04-30","Added TDC/Basis warning calc to LIHTC tab"]
["2019-04-30","Added % of TDC for budget categories - Closing S&U tab ","These are hidden unless the category has information filled out."]
["2019-05-02","Added choice for propane or natural gas on line 22 of Project Info."]
["2019-05-02","Added FFB Operating Reserve to line 126 of Closing S&U tab"]
["2019-05-02","Corrected cell H157 on the Inc & Exp tab to include the commerical management fee","Discussed with Ginny"]
["2019-05-06","Removed the auto-update for the date."]
["2019-05-06","Update print preview on all tabs."]
["2019-05-06","Updated dev team tab to accommodate an email address for contacts. "]
{"$rows_left_out":3}
{"sheet":"Module1","index":11,"n_rows":0,"n_cols":0,"rows_kept":0,"cut":false,"hidden":true,"merged":[]}

{"sheet":"Module2","index":12,"n_rows":0,"n_cols":0,"rows_kept":0,"cut":false,"hidden":true,"merged":[]}